Reaction Details
TargetHistone deacetylase 2
LigandBDBM29589
Substrate/Competitorn/a
Meas. Tech.ChEMBL_1897698 (CHEMBL4399733)
Ki 13±n/a nM
Citation Pflieger, MHamacher, AÖz, THorstick-Muche, NBoesen, BSchrenk, CKassack, MUKurz, T Novel ?,?-unsaturated hydroxamic acid derivatives overcome cisplatin resistance. Bioorg Med Chem27:0 (2019) 
 
Histone deacetylase 2
Name:Histone deacetylase 2
Type:Chromatin regulator; hydrolase; repressor
Mol. Mass.:55356.54
Organism:Homo sapiens (Human)
Description:Q92769
Residue:488
BDBM29589
NameBDBM29589
Synonyms:Faridak LBH-589B US10722597, Compound Panobinostat
TypeSmall organic molecule
Emp. Form.C21H23N3O2
Mol. Mass.349.4262
SMILESCc1[nH]c2ccccc2c1CCNCc1ccc(\C=C\C(=O)NO)cc1