Reaction Details
TargetHistone deacetylase 4
LigandBDBM29589
Substrate/Competitorn/a
Meas. Tech.ChEMBL_1897697 (CHEMBL4399732)
Ki 640±n/a nM
Citation Pflieger, MHamacher, AÖz, THorstick-Muche, NBoesen, BSchrenk, CKassack, MUKurz, T Novel ?,?-unsaturated hydroxamic acid derivatives overcome cisplatin resistance. Bioorg Med Chem27:0 (2019) 
 
Histone deacetylase 4
Name:Histone deacetylase 4
Type:Enzyme
Mol. Mass.:119049.39
Organism:Homo sapiens (Human)
Description:P56524
Residue:1084
BDBM29589
NameBDBM29589
Synonyms:Faridak LBH-589B US10722597, Compound Panobinostat
TypeSmall organic molecule
Emp. Form.C21H23N3O2
Mol. Mass.349.4262
SMILESCc1[nH]c2ccccc2c1CCNCc1ccc(\C=C\C(=O)NO)cc1