Reaction Details
TargetAdenosine receptor A2a
LigandBDBM50080390
Substrate/Competitorn/a
Meas. Tech.ChEMBL_27479 (CHEMBL633041)
Ki 25±n/a nM
Citation Knutsen, LJLau, JPetersen, HThomsen, CWeis, JUShalmi, MJudge, MEHansen, AJSheardown, MJ N-substituted adenosines as novel neuroprotective A(1) agonists with diminished hypotensive effects. J Med Chem42:3463-77 (1999) 
 
Adenosine receptor A2a
Name:Adenosine receptor A2a
Type:G Protein-Coupled Receptor (GPCR)
Mol. Mass.:45015.65
Organism:Rattus norvegicus (rat)
Description:Rat A2A receptors expressed in CHO cells.
Residue:410
BDBM50080390
NameBDBM50080390
Synonyms:(2R,3R,4S,5R)-2-(6-(2-methyl-benzylamino)-9H-purin-9-yl)-5-(hydroxymethyl)-tetrahydrofuran-3,4-diol Adenosine analog, 16 Metrifudil
TypeSmall organic molecule
Emp. Form.C18H21N5O4
Mol. Mass.371.3904
SMILESCc1ccccc1CNc1ncnc2n(cnc12)[C@@H]1O[C@H](CO)[C@@H](O)[C@H]1O