Reaction Details
TargetEndothelin receptor type B
LigandBDBM50080593
Substrate/Competitorn/a
Meas. Tech.ChEMBL_63675 (CHEMBL670478)
IC50 1.2±n/a nM
Citation von Geldern, TWTasker, ASSorensen, BKWinn, MSzczepankiewicz, BGDixon, DBChiou, WJWang, LWessale, JLAdler, AMarsh, KCNguyen, BOpgenorth, TJ Pyrrolidine-3-carboxylic acids as endothelin antagonists. 4. Side chain conformational restriction leads to ET(B) selectivity. J Med Chem42:3668-78 (1999) 
 
Endothelin receptor type B
Name:Endothelin receptor type B
Type:Enzyme Catalytic Domain
Mol. Mass.:49664.00
Organism:Homo sapiens (Human)
Description:ENDOTHELIN B EDNRB HUMAN::P24530
Residue:442
BDBM50080593
NameBDBM50080593
Synonyms:(2R,3R,4S)-4-Benzo[1,3]dioxol-5-yl-1-[(2,6-diethyl-4-methyl-phenylcarbamoyl)-methyl]-2-(4-methoxy-phenyl)-pyrrolidine-3-carboxylic acid | CHEMBL120962
TypeSmall organic molecule
Emp. Form.C32H36N2O6
Mol. Mass.544.638
SMILESCCc1cc(C)cc(CC)c1NC(=O)CN1C[C@@H]([C@H]([C@@H]1c1ccc(OC)cc1)C(O)=O)c1ccc2OCOc2c1