Reaction Details
TargetEndothelin receptor type B
LigandBDBM50080615
Substrate/Competitorn/a
Meas. Tech.ChEMBL_63674 (CHEMBL670477)
IC50 3.4±n/a nM
Citation Liu, GKozmina, NSWinn, Mvon Geldern, TWChiou, WJDixon, DBNguyen, BMarsh, KCOpgenorth, TJ Design, synthesis, and activity of a series of pyrrolidine-3-carboxylic acid-based, highly specific, orally active ET(B) antagonists containing a diphenylmethylamine acetamide side chain. J Med Chem42:3679-89 (1999) 
 
Endothelin receptor type B
Name:Endothelin receptor type B
Type:Enzyme Catalytic Domain
Mol. Mass.:49664.00
Organism:Homo sapiens (Human)
Description:ENDOTHELIN B EDNRB HUMAN::P24530
Residue:442
BDBM50080615
NameBDBM50080615
Synonyms:(2R,3R,4S)-4-Benzo[1,3]dioxol-5-yl-2-(4-methoxy-phenyl)-1-{[(phenyl-o-tolyl-methyl)-carbamoyl]-methyl}-pyrrolidine-3-carboxylic acid; TFA | CHEMBL432227
TypeSmall organic molecule
Emp. Form.C35H34N2O6
Mol. Mass.578.6543
SMILESCOc1ccc(cc1)[C@H]1[C@@H]([C@H](CN1CC(=O)NC(c1ccccc1)c1ccccc1C)c1ccc2OCOc2c1)C(O)=O