Reaction Details
TargetEndothelin receptor type B
LigandBDBM50080627
Substrate/Competitorn/a
Meas. Tech.ChEMBL_63674 (CHEMBL670477)
IC50 3.3±n/a nM
Citation Liu, GKozmina, NSWinn, Mvon Geldern, TWChiou, WJDixon, DBNguyen, BMarsh, KCOpgenorth, TJ Design, synthesis, and activity of a series of pyrrolidine-3-carboxylic acid-based, highly specific, orally active ET(B) antagonists containing a diphenylmethylamine acetamide side chain. J Med Chem42:3679-89 (1999) 
 
Endothelin receptor type B
Name:Endothelin receptor type B
Type:Enzyme Catalytic Domain
Mol. Mass.:49664.00
Organism:Homo sapiens (Human)
Description:ENDOTHELIN B EDNRB HUMAN::P24530
Residue:442
BDBM50080627
NameBDBM50080627
Synonyms:(2R,3R,4S)-4-Benzo[1,3]dioxol-5-yl-1-({[(2-ethyl-phenyl)-o-tolyl-methyl]-carbamoyl}-methyl)-2-[4-(2-isopropoxy-ethoxy)-phenyl]-pyrrolidine-3-carboxylic acid; TFA | CHEMBL123206
TypeSmall organic molecule
Emp. Form.C41H46N2O7
Mol. Mass.678.8131
SMILESCCc1ccccc1C(NC(=O)CN1C[C@@H]([C@H]([C@@H]1c1ccc(OCCOC(C)C)cc1)C(O)=O)c1ccc2OCOc2c1)c1ccccc1C