Reaction Details
TargetSerine protease 1
LigandBDBM50069294
Substrate/Competitorn/a
Meas. Tech.ChEBML_212525
Ki 33000±n/a nM
Citation Lee, KJung, WHHwang, SYLee, SH Fluorobenzamidrazone thrombin inhibitors: influence of fluorine on enhancing oral absorption. Bioorg Med Chem Lett9:2483-6 (1999) Serine protease 1
Name:Serine protease 1
Type:Enzyme
Mol. Mass.:25790.52
Organism:Bos taurus (bovine)
Description:P00760
Residue:246
BDBM50069294
NameBDBM50069294
Synonyms:(S)-3-[4-(carbohydrazonamidol)-phenyl]-N-cyclopentyl-N-methyl-2-(naphthalene-2-sulfonylamino)-propionamide 1N-cyclopentyl-1N-methyl-3-(4-Carbohydrazonamidephenyl)-2-(2-naphthylsulfonamido)-(2S)-propanamide Benzamidrazone analogue N-methyl-N-cyclopentyl-3-(4-hydrazonoformamidephenyl)-2-[(2-naphthylsulfonyl)amino]propanamide
TypeSmall organic molecule
Emp. Form.C26H31N5O3S
Mol. Mass.493.621
SMILESCN(C1CCCC1)C(=O)[C@H](Cc1ccc(cc1)C(N)=NN)NS(=O)(=O)c1ccc2ccccc2c1