Reaction Details
TargetProthrombin
LigandBDBM50080885
Substrate/Competitorn/a
Meas. Tech.ChEBML_208526
Ki 0.200000±n/a nM
Citation Lee, KJung, WHHwang, SYLee, SH Fluorobenzamidrazone thrombin inhibitors: influence of fluorine on enhancing oral absorption. Bioorg Med Chem Lett9:2483-6 (1999) Prothrombin
Name:Prothrombin
Type:Protein
Mol. Mass.:70029.57
Organism:Homo sapiens (Human)
Description:P00734
Residue:622
BDBM50080885
NameBDBM50080885
Synonyms:Benzamidrazone analogue | CHEMBL79304
TypeSmall organic molecule
Emp. Form.C27H32FN5O4S
Mol. Mass.541.637
SMILESCOc1ccc2cc(ccc2c1)S(=O)(=O)N[C@@H](Cc1ccc(cc1F)C(N)=NN)C(=O)N(C)C1CCCC1