Reaction Details
Target5-hydroxytryptamine receptor 1D
LigandBDBM50060425
Substrate/Competitorn/a
Meas. Tech.ChEMBL_1681 (CHEMBL617041)
EC50 0.800000±n/a nM
Citation Russell, MGBeer, MSStanton, JASohal, BMortishire-Smith, RJCastro, JL 2,7-diazabicyclo[3.3.0]octanes as novel h5-HT receptor agonists. Bioorg Med Chem Lett9:2491-6 (1999) 5-hydroxytryptamine receptor 1D
Name:5-hydroxytryptamine receptor 1D
Type:G Protein-Coupled Receptor (GPCR)
Mol. Mass.:41920.63
Organism:Homo sapiens (Human)
Description:Receptor binding assays were performed using human clone stably expressed in CHO cells.
Residue:377
BDBM50060425
NameBDBM50060425
Synonyms:Benzyl-{(S)-1-[2-(5-[1,2,4]triazol-4-yl-1H-indol-3-yl)-ethyl]-pyrrolidin-3-ylmethyl}-amine L-760790
TypeSmall organic molecule
Emp. Form.C24H28N6
Mol. Mass.400.5193
SMILESC(Cc1c[nH]c2ccc(cc12)-n1cnnc1)N1CC[C@@H](CNCc2ccccc2)C1