Reaction Details
TargetDeoxyhypusine hydroxylase
LigandBDBM50042874
Substrate/Competitorn/a
Meas. Tech.ChEMBL_1898739 (CHEMBL4400854)
IC50 5000±n/a nM
Citation Jiang, ZYou, QZhang, X Medicinal chemistry of metal chelating fragments in metalloenzyme active sites: A perspective. Eur J Med Chem165:172-197 (2019) 
 
Deoxyhypusine hydroxylase
Name:Deoxyhypusine hydroxylase
Type:PROTEIN
Mol. Mass.:32886.24
Organism:Homo sapiens
Description:ChEMBL_119191
Residue:302
BDBM50042874
NameBDBM50042874
Synonyms:2,2'-Bipyridin 2,2'-bipyridyl 2,2'-dipyridyl CHEMBL39879 alpha,alpha'-bipyridine alpha,alpha'-dipyridine bpy
TypeSmall organic molecule
Emp. Form.C10H8N2
Mol. Mass.156.1839
SMILESc1ccc(nc1)-c1ccccn1