Reaction Details
TargetD(4) dopamine receptor
LigandBDBM50081107
Substrate/Competitorn/a
Meas. Tech.ChEBML_61325
Ki 11±n/a nM
Citation Mewshaw, RENelson, JAShah, USShi, XMazandarani, HCoupet, JMarquis, KBrennan, JAAndree, TH New generation dopaminergic agents. 7. Heterocyclic bioisosteres that exploit the 3-OH-phenoxyethylamine D2 template. Bioorg Med Chem Lett9:2593-8 (1999) D(4) dopamine receptor
Name:D(4) dopamine receptor
Type:Enzyme
Mol. Mass.:48373.19
Organism:Homo sapiens (Human)
Description:P21917
Residue:419
BDBM50081107
NameBDBM50081107
Synonyms:4-(2-Benzylamino-ethoxy)-6-chloro-1,3-dihydro-benzoimidazole-2-thione | CHEMBL89037
TypeSmall organic molecule
Emp. Form.C16H16ClN3OS
Mol. Mass.333.836
SMILESClc1cc(OCCNCc2ccccc2)c2[nH]c(=S)[nH]c2c1