Reaction Details
TargetProthrombin
LigandBDBM50081157
Substrate/Competitorn/a
Meas. Tech.ChEBML_208905
Ki 1±n/a nM
Citation Minami, NKReiner, JESemple, JE Asymmetric synthesis of novel quaternary alpha-hydroxy-delta-lactam dipeptide surrogates. Bioorg Med Chem Lett9:2625-8 (1999) Prothrombin
Name:Prothrombin
Type:Protein
Mol. Mass.:70029.57
Organism:Homo sapiens (Human)
Description:P00734
Residue:622
BDBM50081157
NameBDBM50081157
Synonyms:(S)-1-[((S)-1-Carbamimidoyl-2-hydroxy-piperidin-3-ylcarbamoyl)-methyl]-2-oxo-3-phenylmethanesulfonylamino-piperidine-3-carboxylic acid ethyl ester | CHEMBL329865
TypeSmall organic molecule
Emp. Form.C23H34N6O7S
Mol. Mass.538.617
SMILESCCOC(=O)[C@@]1(CCCN(CC(=O)N[C@H]2CCCN(C2O)C(N)=N)C1=O)NS(=O)(=O)Cc1ccccc1