Reaction Details
TargetPlasminogen
LigandBDBM50081422
Substrate/Competitorn/a
Meas. Tech.ChEMBL_155432 (CHEMBL765097)
Ki 5000±n/a nM
Citation Abato, PConroy, JLSeto, CT Combinatorial library of serine and cysteine protease inhibitors that interact with both the S and S' binding sites. J Med Chem42:4001-9 (1999) Plasminogen
Name:Plasminogen
Type:Enzyme
Mol. Mass.:90579.18
Organism:Homo sapiens (Human)
Description:n/a
Residue:810
BDBM50081422
NameBDBM50081422
Synonyms:2-((R)-3-{(R)-3-[(S)-2-((S)-Benzyloxycarbonylamino)-3-(1H-indol-3-yl)-propionylamino]-2-oxo-cyclohexyl}-propionylamino)-3-(1H-indol-3-yl)-propionic acid | CHEMBL339593
TypeSmall organic molecule
Emp. Form.C39H41N5O7
Mol. Mass.691.7721
SMILESOC(=O)[C@H](Cc1c[nH]c2ccccc12)NC(=O)CC[C@H]1CCC[C@@H](NC(=O)[C@H](Cc2c[nH]c3ccccc23)NC(=O)OCc2ccccc2)C1=O