Reaction Details
TargetReverse transcriptase/RNaseH
LigandBDBM50081460
Substrate/Competitorn/a
Meas. Tech.ChEBML_195502
IC50>100000±n/a nM
Citation Uckun, FMMao, CPendergrass, SMaher, DZhu, DTuel-Ahlgren, LVenkatachalam, TK N-[2-(1-cyclohexenyl)ethyl]-N'-[2-(5-bromopyridyl)]-thiourea and N'-[2-(1-cyclohexenyl)ethyl]-N'-[2-(5-chloropyridyl)]-thiourea as potent inhibitors of multidrug-resistant human immunodeficiency virus-1. Bioorg Med Chem Lett9:2721-6 (1999) Reverse transcriptase/RNaseH
Name:Reverse transcriptase/RNaseH
Type:PROTEIN
Mol. Mass.:65229.15
Organism:Human immunodeficiency virus 1
Description:ChEMBL_1473730
Residue:566
BDBM50081460
NameBDBM50081460
Synonyms:1-(5-Bromo-pyridin-2-yl)-3-(6,6-dimethyl-bicyclo[3.1.1]hept-3-ylmethyl)-thiourea HI-444
TypeSmall organic molecule
Emp. Form.C16H22BrN3S
Mol. Mass.368.335
SMILESCC1(C)C2CC1CC(CNC(=S)Nc1ccc(Br)cn1)C2