Reaction Details
TargetReverse transcriptase/RNaseH
LigandBDBM1944
Substrate/Competitorn/a
Meas. Tech.ChEBML_195502
IC50 1500±n/a nM
Citation Uckun, FMMao, CPendergrass, SMaher, DZhu, DTuel-Ahlgren, LVenkatachalam, TK N-[2-(1-cyclohexenyl)ethyl]-N'-[2-(5-bromopyridyl)]-thiourea and N'-[2-(1-cyclohexenyl)ethyl]-N'-[2-(5-chloropyridyl)]-thiourea as potent inhibitors of multidrug-resistant human immunodeficiency virus-1. Bioorg Med Chem Lett9:2721-6 (1999) Reverse transcriptase/RNaseH
Name:Reverse transcriptase/RNaseH
Type:PROTEIN
Mol. Mass.:65229.15
Organism:Human immunodeficiency virus 1
Description:ChEMBL_1473730
Residue:566
BDBM1944
NameBDBM1944
Synonyms:BHAP deriv. DELAVIRDINE MESYLATE N-[2-({4-[3-(propan-2-ylamino)pyridin-2-yl]piperazin-1-yl}carbonyl)-1H-indol-5-yl]methanesulfonamide U-90152S
TypeSmall organic molecule
Emp. Form.C22H28N6O3S
Mol. Mass.456.561
SMILESCC(C)Nc1cccnc1N1CCN(CC1)C(=O)c1cc2cc(NS(C)(=O)=O)ccc2[nH]1