Reaction Details
TargetCoagulation factor X
LigandBDBM50081513
Substrate/Competitorn/a
Meas. Tech.ChEBML_69683
Ki 36±n/a nM
Citation Becker, MREwing, WRDavis, RSPauls, HWLy, CLi, AMason, HJChoi-Sledeski, YMSpada, APChu, VBrown, KDColussi, DJLeadley, RJBentley, RBostwick, JKasiewski, CMorgan, S Synthesis, SAR and in vivo activity of novel thienopyridine sulfonamide pyrrolidinones as factor Xa inhibitors. Bioorg Med Chem Lett9:2753-8 (1999) Coagulation factor X
Name:Coagulation factor X
Type:Enzyme
Mol. Mass.:54726.60
Organism:Homo sapiens (Human)
Description:n/a
Residue:488
BDBM50081513
NameBDBM50081513
Synonyms:3-[(S)-3-(5-Chloro-3-methyl-benzo[b]thiophene-2-sulfonylamino)-2-oxo-pyrrolidin-1-ylmethyl]-benzamidine | CHEMBL418958
TypeSmall organic molecule
Emp. Form.C21H21ClN4O3S2
Mol. Mass.476.999
SMILESCc1c(sc2ccc(Cl)cc12)S(=O)(=O)N[C@H]1CCN(Cc2cccc(c2)C(N)=N)C1=O