Reaction Details
TargetCoagulation factor X
LigandBDBM50081517
Substrate/Competitorn/a
Meas. Tech.ChEMBL_197822 (CHEMBL802351)
Ki 3±n/a nM
Citation Becker, MREwing, WRDavis, RSPauls, HWLy, CLi, AMason, HJChoi-Sledeski, YMSpada, APChu, VBrown, KDColussi, DJLeadley, RJBentley, RBostwick, JKasiewski, CMorgan, S Synthesis, SAR and in vivo activity of novel thienopyridine sulfonamide pyrrolidinones as factor Xa inhibitors. Bioorg Med Chem Lett9:2753-8 (1999) Coagulation factor X
Name:Coagulation factor X
Type:Enzyme
Mol. Mass.:54726.60
Organism:Homo sapiens (Human)
Description:n/a
Residue:488
BDBM50081517
NameBDBM50081517
Synonyms:4-Hydroxy-3-[(S)-2-oxo-3-(thieno[3,2-c]pyridine-2-sulfonylamino)-pyrrolidin-1-ylmethyl]-benzamidine | CHEMBL330011
TypeSmall organic molecule
Emp. Form.C19H19N5O4S2
Mol. Mass.445.515
SMILESNC(=N)c1ccc(O)c(CN2CC[C@H](NS(=O)(=O)c3cc4cnccc4s3)C2=O)c1