Reaction Details
TargetCoagulation factor X
LigandBDBM50081510
Substrate/Competitorn/a
Meas. Tech.ChEMBL_197822 (CHEMBL802351)
Ki 3±n/a nM
Citation Becker, MREwing, WRDavis, RSPauls, HWLy, CLi, AMason, HJChoi-Sledeski, YMSpada, APChu, VBrown, KDColussi, DJLeadley, RJBentley, RBostwick, JKasiewski, CMorgan, S Synthesis, SAR and in vivo activity of novel thienopyridine sulfonamide pyrrolidinones as factor Xa inhibitors. Bioorg Med Chem Lett9:2753-8 (1999) Coagulation factor X
Name:Coagulation factor X
Type:Enzyme
Mol. Mass.:54726.60
Organism:Homo sapiens (Human)
Description:n/a
Residue:488
BDBM50081510
NameBDBM50081510
Synonyms:4-Amino-3-[(S)-3-(5-chloro-thieno[3,2-b]pyridine-2-sulfonylamino)-2-oxo-pyrrolidin-1-ylmethyl]-benzamidine | CHEMBL431281
TypeSmall organic molecule
Emp. Form.C19H19ClN6O3S2
Mol. Mass.478.976
SMILESNC(=N)c1ccc(N)c(CN2CC[C@H](NS(=O)(=O)c3cc4nc(Cl)ccc4s3)C2=O)c1