Reaction Details
TargetGag-Pol polyprotein [489-587]
LigandBDBM344
Substrate/Competitorn/a
Meas. Tech.ChEMBL_157724 (CHEMBL763397)
Ki 43±n/a nM
Citation Hultén, JAndersson, HOSchaal, WDanielson, HUClasson, BKvarnström, IKarlén, AUnge, TSamuelsson, BHallberg, A Inhibitors of the C(2)-symmetric HIV-1 protease: nonsymmetric binding of a symmetric cyclic sulfamide with ketoxime groups in the P2/P2' side chains. J Med Chem42:4054-61 (1999) Gag-Pol polyprotein [489-587]
Name:Gag-Pol polyprotein [489-587]
Type:Enzyme Subunit
Mol. Mass.:10781.16
Organism:Human immunodeficiency virus type 1
Description:P04585[489-587]
Residue:99
BDBM344
NameBDBM344
Synonyms:(3R,4S,5S,6R)-4,5-dihydroxy-2,7-bis({[3-(2-hydroxyethyl)phenyl]methyl})-3,6-bis(phenoxymethyl)-1,2,7-thiadiazepane-1,1-dione Cyclic Sulfamide deriv. 22
TypeSmall organic molecule
Emp. Form.C36H42N2O8S
Mol. Mass.662.792
SMILESOCCc1cccc(CN2[C@H](COc3ccccc3)[C@H](O)[C@@H](O)[C@@H](COc3ccccc3)N(Cc3cccc(CCO)c3)S2(=O)=O)c1