Reaction Details
TargetProtein kinase C alpha type
LigandBDBM50081620
Substrate/Competitorn/a
Meas. Tech.ChEMBL_160286 (CHEMBL769614)
Ki 1860±n/a nM
Citation Lee, JKang, JHLee, SYHan, KCTorres, CMBhattacharyya, DKBlumberg, PMMarquez, VE Protein kinase C ligands based on tetrahydrofuran templates containing a new set of phorbol ester pharmacophores. J Med Chem42:4129-39 (1999) Protein kinase C alpha type
Name:Protein kinase C alpha type
Type:Enzyme
Mol. Mass.:76755.65
Organism:Homo sapiens (Human)
Description:The recombinant human PKC enzymes were produced using a baculovirus expression system in SF9 cells
Residue:672
BDBM50081620
NameBDBM50081620
Synonyms:CHEMBL132843 | [5-Acetoxymethyl-5-hydroxymethyl-dihydro-furan-(3E)-ylidene]-acetic acid octadecyl ester
TypeSmall organic molecule
Emp. Form.C28H50O6
Mol. Mass.482.693
(=O)\C=C1\COC(CO)(COC(C)=O)C1