Reaction Details
TargetProtein kinase C alpha type
LigandBDBM50081614
Substrate/Competitorn/a
Meas. Tech.ChEMBL_160286 (CHEMBL769614)
Ki 12780±n/a nM
Citation Lee, JKang, JHLee, SYHan, KCTorres, CMBhattacharyya, DKBlumberg, PMMarquez, VE Protein kinase C ligands based on tetrahydrofuran templates containing a new set of phorbol ester pharmacophores. J Med Chem42:4129-39 (1999) Protein kinase C alpha type
Name:Protein kinase C alpha type
Type:Enzyme
Mol. Mass.:76755.65
Organism:Homo sapiens (Human)
Description:The recombinant human PKC enzymes were produced using a baculovirus expression system in SF9 cells
Residue:672
BDBM50081614
NameBDBM50081614
Synonyms:CHEMBL133170 | Hexanoic acid (2R,5S)-2-hydroxymethyl-5-tetradecyloxycarbonylmethyl-tetrahydro-furan-2-ylmethyl ester
TypeSmall organic molecule
Emp. Form.C28H52O6
Mol. Mass.484.7089
(=O)C[C@@H]1CC[C@@](CO)(COC(=O)CCCCC)O1