Reaction Details
TargetBeta-2 adrenergic receptor
LigandBDBM50526681
Substrate/Competitorn/a
Meas. Tech.ChEMBL_1900546 (CHEMBL4402768)
Ki 0.160000±n/a nM
Citation Schwalbe, THuebner, HGmeiner, P Development of covalent antagonists for ?1- and ?2-adrenergic receptors. Bioorg Med Chem27:2959-2971 (2019) 
 
Beta-2 adrenergic receptor
Name:Beta-2 adrenergic receptor
Type:n/a
Mol. Mass.:46461.69
Organism:Homo sapiens (Human)
Description:P07550
Residue:413
BDBM50526681
NameBDBM50526681
Synonyms:CHEMBL4537221
TypeSmall organic molecule
Emp. Form.C26H34N2O4S2
Mol. Mass.502.689
SMILESCOc1cc(CCNC[C@H](O)COc2cccc3ccccc23)ccc1OCCSSCCN