Reaction Details
TargetAdenosine receptor A1
LigandBDBM50081672
Substrate/Competitorn/a
Meas. Tech.ChEMBL_29488 (CHEMBL873045)
Ki 14500±n/a nM
Citation Xie, RLi, AHJi, XDMelman, NOlah, MEStiles, GLJacobson, KA Selective A(3) adenosine receptor antagonists: water-soluble 3, 5-diacyl-1,2,4-trialkylpyridinium salts and their oxidative generation from dihydropyridine precursors. J Med Chem42:4232-8 (1999) Adenosine receptor A1
Name:Adenosine receptor A1
Type:Protein
Mol. Mass.:36704.13
Organism:Rattus norvegicus (rat)
Description:n/a
Residue:326
BDBM50081672
NameBDBM50081672
Synonyms:2-Butyl-5-ethoxycarbonyl-4-ethyl-3-ethylsulfanylcarbonyl-1-methyl-6-phenyl-pyridinium; iodide | CHEMBL337088
TypeSmall organic molecule
Emp. Form.C24H32NO3S
Mol. Mass.414.58
SMILESCCCCc1c(C(=O)SCC)c(CC)c(C(=O)OCC)c(-c2ccccc2)[n+]1C