Reaction Details
TargetAdenosine receptor A1
LigandBDBM50081669
Substrate/Competitorn/a
Meas. Tech.ChEMBL_29488 (CHEMBL873045)
Ki 76900.0±n/a nM
Citation Xie, RLi, AHJi, XDMelman, NOlah, MEStiles, GLJacobson, KA Selective A(3) adenosine receptor antagonists: water-soluble 3, 5-diacyl-1,2,4-trialkylpyridinium salts and their oxidative generation from dihydropyridine precursors. J Med Chem42:4232-8 (1999) Adenosine receptor A1
Name:Adenosine receptor A1
Type:Protein
Mol. Mass.:36704.13
Organism:Rattus norvegicus (rat)
Description:n/a
Residue:326
BDBM50081669
NameBDBM50081669
Synonyms:3-Ethoxycarbonyl-4,6-diethyl-5-ethylsulfanylcarbonyl-2-phenyl-1-propyl-pyridinium; iodide | CHEMBL336629
TypeSmall organic molecule
Emp. Form.C24H32NO3S
Mol. Mass.414.58
SMILESCCC[n+]1c(CC)c(C(=O)SCC)c(CC)c(C(=O)OCC)c1-c1ccccc1