Reaction Details
TargetAdenosine receptor A2a
LigandBDBM50081678
Substrate/Competitorn/a
Meas. Tech.ChEMBL_30134 (CHEMBL641176)
Ki 33200.0±n/a nM
Citation Xie, RLi, AHJi, XDMelman, NOlah, MEStiles, GLJacobson, KA Selective A(3) adenosine receptor antagonists: water-soluble 3, 5-diacyl-1,2,4-trialkylpyridinium salts and their oxidative generation from dihydropyridine precursors. J Med Chem42:4232-8 (1999) Adenosine receptor A2a
Name:Adenosine receptor A2a
Type:G Protein-Coupled Receptor (GPCR)
Mol. Mass.:45015.65
Organism:Rattus norvegicus (rat)
Description:Rat A2A receptors expressed in CHO cells.
Residue:410
BDBM50081678
NameBDBM50081678
Synonyms:2-Cyclobutyl-5-ethoxycarbonyl-4-ethyl-3-ethylsulfanylcarbonyl-1-methyl-6-phenyl-pyridinium; iodide | CHEMBL340552
TypeSmall organic molecule
Emp. Form.C24H30NO3S
Mol. Mass.412.564
SMILESCCOC(=O)c1c(CC)c(C(=O)SCC)c(C2CCC2)[n+](C)c1-c1ccccc1