Reaction Details
TargetAdenosine receptor A3
LigandBDBM50081670
Substrate/Competitorn/a
Meas. Tech.ChEMBL_29889 (CHEMBL641960)
Ki 1250±n/a nM
Citation Xie, RLi, AHJi, XDMelman, NOlah, MEStiles, GLJacobson, KA Selective A(3) adenosine receptor antagonists: water-soluble 3, 5-diacyl-1,2,4-trialkylpyridinium salts and their oxidative generation from dihydropyridine precursors. J Med Chem42:4232-8 (1999) Adenosine receptor A3
Name:Adenosine receptor A3
Type:G Protein-Coupled Receptor (GPCR)
Mol. Mass.:36197.32
Organism:Homo sapiens (Human)
Description:P0DMS8
Residue:318
BDBM50081670
NameBDBM50081670
Synonyms:4-[2-(1,3-Dioxo-1,3-dihydro-isoindol-2-yl)-ethyl]-3-ethoxycarbonyl-6-ethyl-5-ethylsulfanylcarbonyl-1-methyl-2-phenyl-pyridinium; iodide | CHEMBL337503
TypeSmall organic molecule
Emp. Form.C30H31N2O5S
Mol. Mass.531.642
SMILESCCOC(=O)c1c(CCN2C(=O)c3ccccc3C2=O)c(C(=O)SCC)c(CC)[n+](C)c1-c1ccccc1