Reaction Details
TargetProteasome subunit beta type-8
LigandBDBM50526811
Substrate/Competitorn/a
Meas. Tech.ChEMBL_1901154 (CHEMBL4403376)
IC50 0.039000±n/a nM
Citation Xi, JZhuang, RKong, LHe, RZhu, HZhang, J Immunoproteasome-selective inhibitors: An overview of recent developments as potential drugs for hematologic malignancies and autoimmune diseases. Eur J Med Chem182:0 (2019) 
 
Proteasome subunit beta type-8
Name:Proteasome subunit beta type-8
Type:PROTEIN
Mol. Mass.:30357.49
Organism:Homo sapiens (Human)
Description:ChEMBL_1446797
Residue:276
BDBM50526811
NameBDBM50526811
Synonyms:Kzr-616
TypeSmall organic molecule
Emp. Form.C30H42N4O8
Mol. Mass.586.6765
SMILESCOc1ccc(cc1)[C@@H](O)[C@H](NC(=O)[C@H](C)NC(=O)CN1CCOCC1)C(=O)N[C@@H](CC1=CCCC1)C(=O)[C@@]1(C)CO1