Reaction Details
TargetProthrombin
LigandBDBM50082040
Substrate/Competitorn/a
Meas. Tech.ChEMBL_208887 (CHEMBL814944)
Ki 0.27±n/a nM
Citation Hoffmann, DKramer, BWashio, TSteinmetzer, TRarey, MLengauer, T Two-stage method for protein-ligand docking. J Med Chem42:4422-33 (1999) Prothrombin
Name:Prothrombin
Type:Protein
Mol. Mass.:70029.57
Organism:Homo sapiens (Human)
Description:P00734
Residue:622
BDBM50082040
NameBDBM50082040
Synonyms:(S)-1-((R)-3-Phenyl-2-phenylmethanesulfonylamino-propionyl)-pyrrolidine-2-carboxylic acid (4-carbamimidoylmethyl-cyclohexyl)-amide | CHEMBL138049
TypeSmall organic molecule
Emp. Form.C29H39N5O4S
Mol. Mass.553.716
SMILESNC(=N)C[C@H]1CC[C@H](CC1)NC(=O)[C@@H]1CCCN1C(=O)[C@@H](Cc1ccccc1)NS(=O)(=O)Cc1ccccc1