Reaction Details
TargetPeptidyl-prolyl cis-trans isomerase FKBP1A
LigandBDBM50030448
Substrate/Competitorn/a
Meas. Tech.ChEMBL_66272 (CHEMBL678142)
IC50 2.3±n/a nM
Citation Wiedeman, PEFesik, SWPetros, AMNettesheim, DGMollison, KWLane, BCOr, YSLuly, JR Retention of immunosuppressant activity in an ascomycin analogue lacking a hydrogen-bonding interaction with FKBP12. J Med Chem42:4456-61 (1999) Peptidyl-prolyl cis-trans isomerase FKBP1A
Name:Peptidyl-prolyl cis-trans isomerase FKBP1A
Type:Isomerase
Mol. Mass.:11953.09
Organism:Homo sapiens (Human)
Description:P62942
Residue:108
BDBM50030448
NameBDBM50030448
Synonyms:8-DEETHYL-8-[BUT-3-ENYL]-ASCOMYCIN TACROLIMUS
TypeSmall organic molecule
Emp. Form.C44H69NO12
Mol. Mass.804.0182
SMILESCO[C@@H]1C[C@@H](CC[C@H]1O)\C=C(/C)[C@H]1OC(=O)[C@@H]2CCCCN2C(=O)C(=O)[C@]2(O)O[C@@H]([C@H](C[C@H]2C)OC)[C@H](C[C@@H](C)C\C(C)=C\[C@@H](CC=C)C(=O)C[C@H](O)[C@H]1C)OC