Reaction Details
TargetUrokinase-type plasminogen activator
LigandBDBM50072857
Substrate/Competitorn/a
Meas. Tech.ChEMBL_155743 (CHEMBL760893)
Ki 2000±n/a nM
Citation Stürzebecher, JVieweg, HSteinmetzer, TSchweinitz, AStubbs, MTRenatus, MWikström, P 3-Amidinophenylalanine-based inhibitors of urokinase. Bioorg Med Chem Lett9:3147-52 (1999) Urokinase-type plasminogen activator
Name:Urokinase-type plasminogen activator
Type:Enzyme
Mol. Mass.:48528.62
Organism:Homo sapiens (Human)
Description:P00749
Residue:431
BDBM50072857
NameBDBM50072857
Synonyms:3-[3-(4-Methyl-piperidin-1-yl)-3-oxo-2-(2,4,6-triisopropyl-benzenesulfonylamino)-propyl]-benzamidine | CHEMBL106079
TypeSmall organic molecule
Emp. Form.C31H46N4O3S
Mol. Mass.554.787
SMILESCC(C)c1cc(C(C)C)c(c(c1)C(C)C)S(=O)(=O)NC(Cc1cccc(c1)C(N)=N)C(=O)N1CCC(C)CC1