Reaction Details
TargetPlasminogen
LigandBDBM50082182
Substrate/Competitorn/a
Meas. Tech.ChEBML_155241
Ki 12000±n/a nM
Citation Stürzebecher, JVieweg, HSteinmetzer, TSchweinitz, AStubbs, MTRenatus, MWikström, P 3-Amidinophenylalanine-based inhibitors of urokinase. Bioorg Med Chem Lett9:3147-52 (1999) Plasminogen
Name:Plasminogen
Type:Enzyme
Mol. Mass.:90579.18
Organism:Homo sapiens (Human)
Description:n/a
Residue:810
BDBM50082182
NameBDBM50082182
Synonyms:3-[2-(Naphthalene-2-sulfonylamino)-3-oxo-3-pyrrolidin-1-yl-propyl]-benzamidine | CHEMBL106869
TypeSmall organic molecule
Emp. Form.C24H26N4O3S
Mol. Mass.450.553
SMILESNC(=N)c1cccc(CC(NS(=O)(=O)c2ccc3ccccc3c2)C(=O)N2CCCC2)c1