Reaction Details
TargetPlasminogen
LigandBDBM50082188
Substrate/Competitorn/a
Meas. Tech.ChEBML_155241
Ki 2800±n/a nM
Citation Stürzebecher, JVieweg, HSteinmetzer, TSchweinitz, AStubbs, MTRenatus, MWikström, P 3-Amidinophenylalanine-based inhibitors of urokinase. Bioorg Med Chem Lett9:3147-52 (1999) Plasminogen
Name:Plasminogen
Type:Enzyme
Mol. Mass.:90579.18
Organism:Homo sapiens (Human)
Description:n/a
Residue:810
BDBM50082188
NameBDBM50082188
Synonyms:3-[3-Azepan-1-yl-3-oxo-2-(2,4,6-triisopropyl-benzenesulfonylamino)-propyl]-benzamidine | CHEMBL107203
TypeSmall organic molecule
Emp. Form.C31H46N4O3S
Mol. Mass.554.787
SMILESCC(C)c1cc(C(C)C)c(c(c1)C(C)C)S(=O)(=O)NC(Cc1cccc(c1)C(N)=N)C(=O)N1CCCCCC1