Reaction Details
TargetPlasminogen
LigandBDBM50082177
Substrate/Competitorn/a
Meas. Tech.ChEBML_155241
Ki 1000±n/a nM
Citation Stürzebecher, JVieweg, HSteinmetzer, TSchweinitz, AStubbs, MTRenatus, MWikström, P 3-Amidinophenylalanine-based inhibitors of urokinase. Bioorg Med Chem Lett9:3147-52 (1999) Plasminogen
Name:Plasminogen
Type:Enzyme
Mol. Mass.:90579.18
Organism:Homo sapiens (Human)
Description:n/a
Residue:810
BDBM50082177
NameBDBM50082177
Synonyms:1-[3-(3-Carbamimidoyl-phenyl)-2-(2,4,6-triisopropyl-benzenesulfonylamino)-propionyl]-piperidine-2-carboxylic acid methyl ester | CHEMBL105875
TypeSmall organic molecule
Emp. Form.C32H46N4O5S
Mol. Mass.598.796
SMILESCOC(=O)C1CCCCN1C(=O)C(Cc1cccc(c1)C(N)=N)NS(=O)(=O)c1c(cc(cc1C(C)C)C(C)C)C(C)C