Reaction Details
TargetPlasminogen
LigandBDBM50082189
Substrate/Competitorn/a
Meas. Tech.ChEBML_155241
Ki 12000±n/a nM
Citation Stürzebecher, JVieweg, HSteinmetzer, TSchweinitz, AStubbs, MTRenatus, MWikström, P 3-Amidinophenylalanine-based inhibitors of urokinase. Bioorg Med Chem Lett9:3147-52 (1999) Plasminogen
Name:Plasminogen
Type:Enzyme
Mol. Mass.:90579.18
Organism:Homo sapiens (Human)
Description:n/a
Residue:810
BDBM50082189
NameBDBM50082189
Synonyms:1-[3-(3-Carbamimidoyl-phenyl)-2-(2,4,6-triisopropyl-benzenesulfonylamino)-propionyl]-piperidine-4-carboxylic acid | CHEMBL323452
TypeSmall organic molecule
Emp. Form.C31H44N4O5S
Mol. Mass.584.77
SMILESCC(C)c1cc(C(C)C)c(c(c1)C(C)C)S(=O)(=O)NC(Cc1cccc(c1)C(N)=N)C(=O)N1CCC(CC1)C(O)=O