Reaction Details
TargetPlasminogen
LigandBDBM50082183
Substrate/Competitorn/a
Meas. Tech.ChEBML_155241
Ki 4500±n/a nM
Citation Stürzebecher, JVieweg, HSteinmetzer, TSchweinitz, AStubbs, MTRenatus, MWikström, P 3-Amidinophenylalanine-based inhibitors of urokinase. Bioorg Med Chem Lett9:3147-52 (1999) Plasminogen
Name:Plasminogen
Type:Enzyme
Mol. Mass.:90579.18
Organism:Homo sapiens (Human)
Description:n/a
Residue:810
BDBM50082183
NameBDBM50082183
Synonyms:3-[3-Morpholin-4-yl-3-oxo-2-(2,4,6-triisopropyl-benzenesulfonylamino)-propyl]-benzamidine | CHEMBL106412
TypeSmall organic molecule
Emp. Form.C29H42N4O4S
Mol. Mass.542.733
SMILESCC(C)c1cc(C(C)C)c(c(c1)C(C)C)S(=O)(=O)NC(Cc1cccc(c1)C(N)=N)C(=O)N1CCOCC1