Reaction Details
TargetUrokinase-type plasminogen activator
LigandBDBM50082178
Substrate/Competitorn/a
Meas. Tech.ChEMBL_155743 (CHEMBL760893)
Ki 28000±n/a nM
Citation Stürzebecher, JVieweg, HSteinmetzer, TSchweinitz, AStubbs, MTRenatus, MWikström, P 3-Amidinophenylalanine-based inhibitors of urokinase. Bioorg Med Chem Lett9:3147-52 (1999) Urokinase-type plasminogen activator
Name:Urokinase-type plasminogen activator
Type:Enzyme
Mol. Mass.:48528.62
Organism:Homo sapiens (Human)
Description:P00749
Residue:431
BDBM50082178
NameBDBM50082178
Synonyms:3-[3-Azepan-1-yl-2-(naphthalene-2-sulfonylamino)-3-oxo-propyl]-benzamidine | CHEMBL107592
TypeSmall organic molecule
Emp. Form.C26H30N4O3S
Mol. Mass.478.606
SMILESNC(=N)c1cccc(CC(NS(=O)(=O)c2ccc3ccccc3c2)C(=O)N2CCCCCC2)c1