Reaction Details
TargetUrokinase-type plasminogen activator
LigandBDBM50082194
Substrate/Competitorn/a
Meas. Tech.ChEMBL_155743 (CHEMBL760893)
Ki 860.0±n/a nM
Citation Stürzebecher, JVieweg, HSteinmetzer, TSchweinitz, AStubbs, MTRenatus, MWikström, P 3-Amidinophenylalanine-based inhibitors of urokinase. Bioorg Med Chem Lett9:3147-52 (1999) Urokinase-type plasminogen activator
Name:Urokinase-type plasminogen activator
Type:Enzyme
Mol. Mass.:48528.62
Organism:Homo sapiens (Human)
Description:P00749
Residue:431
BDBM50082194
NameBDBM50082194
Synonyms:4-[3-(3-Carbamimidoyl-phenyl)-2-(2,4,6-triisopropyl-benzenesulfonylamino)-propionyl]-piperazine-1-carboxylic acid methyl ester | CHEMBL326866
TypeSmall organic molecule
Emp. Form.C31H45N5O5S
Mol. Mass.599.785
SMILESCOC(=O)N1CCN(CC1)C(=O)C(Cc1cccc(c1)C(N)=N)NS(=O)(=O)c1c(cc(cc1C(C)C)C(C)C)C(C)C