Reaction Details
TargetAnionic trypsin
LigandBDBM50082183
Substrate/Competitorn/a
Meas. Tech.ChEBML_212167
Ki 490.0±n/a nM
Citation Stürzebecher, JVieweg, HSteinmetzer, TSchweinitz, AStubbs, MTRenatus, MWikström, P 3-Amidinophenylalanine-based inhibitors of urokinase. Bioorg Med Chem Lett9:3147-52 (1999) Anionic trypsin
Name:Anionic trypsin
Type:PROTEIN
Mol. Mass.:26281.39
Organism:Bos taurus
Description:ChEMBL_212177
Residue:247
BDBM50082183
NameBDBM50082183
Synonyms:3-[3-Morpholin-4-yl-3-oxo-2-(2,4,6-triisopropyl-benzenesulfonylamino)-propyl]-benzamidine | CHEMBL106412
TypeSmall organic molecule
Emp. Form.C29H42N4O4S
Mol. Mass.542.733
SMILESCC(C)c1cc(C(C)C)c(c(c1)C(C)C)S(=O)(=O)NC(Cc1cccc(c1)C(N)=N)C(=O)N1CCOCC1