Reaction Details
TargetUrokinase-type plasminogen activator
LigandBDBM16175
Substrate/Competitorn/a
Meas. Tech.ChEMBL_155743 (CHEMBL760893)
Ki 960.0±n/a nM
Citation Stürzebecher, JVieweg, HSteinmetzer, TSchweinitz, AStubbs, MTRenatus, MWikström, P 3-Amidinophenylalanine-based inhibitors of urokinase. Bioorg Med Chem Lett9:3147-52 (1999) Urokinase-type plasminogen activator
Name:Urokinase-type plasminogen activator
Type:Enzyme
Mol. Mass.:48528.62
Organism:Homo sapiens (Human)
Description:P00749
Residue:431
BDBM16175
NameBDBM16175
Synonyms:CHEMBL108468 ethyl 4-(3-carbamimidoyl-N-{[2,4,6-tris(1-methylethyl)phenyl]sulfonyl}phenylalanyl)piperazine-1-carboxylate | ethyl 4-[3-(3-carbamimidoylphenyl)-2-{[2,4,6-tris(propan-2-yl)benzene]sulfonamido}propanoyl]piperazine-1-carboxylate
TypeSmall organic molecule
Emp. Form.C32H47N5O5S
Mol. Mass.613.811
SMILESCCOC(=O)N1CCN(CC1)C(=O)C(Cc1cccc(c1)C(N)=N)NS(=O)(=O)c1c(cc(cc1C(C)C)C(C)C)C(C)C