Reaction Details
TargetMuscarinic acetylcholine receptor M1
LigandBDBM50450971
Substrate/Competitorn/a
Meas. Tech.ChEBML_139954
IC50 110±n/a nM
Citation Novelli, FSparatore, ATasso, BSparatore, F Quinolizidinyl derivatives of 5,11-dihydro-6H-pyrido[2,3-b][1,4]benzodiazepin-6-one as ligands for muscarinic receptors. Bioorg Med Chem Lett9:3031-4 (1999) Muscarinic acetylcholine receptor M1
Name:Muscarinic acetylcholine receptor M1
Type:Enzyme Catalytic Domain
Mol. Mass.:51390.46
Organism:RAT
Description:P08482
Residue:460
BDBM50450971
NameBDBM50450971
Synonyms:CHEMBL2112418
TypeSmall organic molecule
Emp. Form.C23H26N4O2
Mol. Mass.390.4781
SMILESO=C(C[C@@H]1CCCN2CCCCC12)N1c2ccccc2C(=O)Nc2cccnc12