Reaction Details
Target5'-nucleotidase
LigandBDBM18136
Substrate/Competitorn/a
Meas. Tech.ChEMBL_1903435 (CHEMBL4405657)
Ki 88±n/a nM
Citation Beatty, JWLindsey, EAThomas-Tran, RDebien, LMandal, DJeffrey, JLTran, ATFournier, JJacob, SDYan, XDrew, SLGinn, EChen, APham, ATZhao, SJin, LYoung, SWWalker, NPLeleti, MRMoschütz, SSträter, NPowers, JPLawson, KV Discovery of Potent and Selective Non-Nucleotide Small Molecule Inhibitors of CD73. J Med Chem63:3935-3955 (2020) 
 
5'-nucleotidase
Name:5'-nucleotidase
Type:Enzyme
Mol. Mass.:63371.54
Organism:Homo sapiens (Human)
Description:P21589
Residue:574
BDBM18136
NameBDBM18136
Synonyms:ADP, alpha beta-me [({[(2R,3S,4R,5R)-5-(6-amino-9H-purin-9-yl)-3,4-dihydroxyoxolan-2-yl]methoxy}(hydroxy)phosphoryl)methyl]phosphonic acid cid_92199
TypeNucleoside or nucleotide
Emp. Form.C11H17N5O9P2
Mol. Mass.425.2283
SMILESNc1ncnc2n(cnc12)[C@@H]1O[C@H](COP(O)(=O)CP(O)(O)=O)[C@@H](O)[C@H]1O