Reaction Details
TargetAdenosine receptor A3
LigandBDBM85618
Substrate/Competitorn/a
Meas. Tech.ChEMBL_31989 (CHEMBL646437)
Ki 0.29±n/a nM
Citation Baraldi, PGCacciari, BRomagnoli, RSpalluto, GKlotz, KNLeung, EVarani, KGessi, SMerighi, SBorea, PA Pyrazolo[4,3-e]-1,2,4-triazolo[1,5-c]pyrimidine derivatives as highly potent and selective human A(3) adenosine receptor antagonists. J Med Chem42:4473-8 (1999) Adenosine receptor A3
Name:Adenosine receptor A3
Type:G Protein-Coupled Receptor (GPCR)
Mol. Mass.:36197.32
Organism:Homo sapiens (Human)
Description:P0DMS8
Residue:318
BDBM85618
NameBDBM85618
Synonyms:CHEMBL302765 MRE 3008F20
TypeSmall organic molecule
Emp. Form.C21H20N8O3
Mol. Mass.432.4353
SMILESCCCn1cc2c(n1)nc(NC(=O)Nc1ccc(OC)cc1)n1nc(nc21)-c1ccco1