Reaction Details
TargetSigma non-opioid intracellular receptor 1
LigandBDBM50082624
Substrate/Competitorn/a
Meas. Tech.ChEMBL_201431 (CHEMBL809834)
Ki 3.36±n/a nM
Citation Carroll, FIBai, XDehghani, AMascarella, SWWilliams, WBowen, WD Asymmetric synthesis of 9-alkyl-2-benzyl-6,7-benzomorphans: characterization as novel sigma receptor ligands. J Med Chem42:4621-9 (1999) Sigma non-opioid intracellular receptor 1
Name:Sigma non-opioid intracellular receptor 1
Type:Enzyme Catalytic Domain
Mol. Mass.:25124.85
Organism:Homo sapiens (Human)
Description:Q99720
Residue:223
BDBM50082624
NameBDBM50082624
Synonyms:(2R,6R,11R)-3-Benzyl-11-ethyl-1,2,3,4,5,6-hexahydro-2,6-methano-benzo[d]azocine | CHEMBL139900
TypeSmall organic molecule
Emp. Form.C21H25N
Mol. Mass.291.4299
SMILESCC[C@H]1[C@H]2Cc3ccccc3[C@@H]1CCN2Cc1ccccc1