Reaction Details
TargetAlpha-1D adrenergic receptor
LigandBDBM50082810
Substrate/Competitorn/a
Meas. Tech.ChEMBL_32452 (CHEMBL643400)
Ki 260±n/a nM
Citation Murali Dhar, TGNagarathnam, DMarzabadi, MRLagu, BWong, WCChiu, GTyagarajan, SMiao, SWZhang, FSun, WTian, DShen, QZhang, JWetzel, JMForray, CChang, RSBroten, TPSchorn, TWChen, TBO'Malley, SRansom, RSchneck, KBendesky, RHarrell, CMVyas, KP Design and synthesis of novel alpha(1)(a) adrenoceptor-selective antagonists. 2. Approaches to eliminate opioid agonist metabolites via modification of linker and 4-methoxycarbonyl-4-phenylpiperidine moiety. J Med Chem42:4778-93 (1999) Alpha-1D adrenergic receptor
Name:Alpha-1D adrenergic receptor
Type:Enzyme Catalytic Domain
Mol. Mass.:60485.82
Organism:Homo sapiens (Human)
Description:adrenergic Alpha1D ADRA1D HUMAN::P25100
Residue:572
BDBM50082810
NameBDBM50082810
Synonyms:3-[3-(4-Cyano-4-phenyl-piperidin-1-yl)-propylcarbamoyl]-4-(3,4-difluoro-phenyl)-6-methoxymethyl-2-oxo-1,2,3,4-tetrahydro-pyrimidine-5-carboxylic acid methyl ester | CHEMBL142929
TypeSmall organic molecule
Emp. Form.C30H33F2N5O5
Mol. Mass.581.6103
SMILESCOCC1=C(C(N(C(=O)NCCCN2CCC(CC2)(C#N)c2ccccc2)C(=O)N1)c1ccc(F)c(F)c1)C(=O)OC