Reaction Details
TargetAlpha-1A adrenergic receptor
LigandBDBM50082812
Substrate/Competitorn/a
Meas. Tech.ChEMBL_33740 (CHEMBL647055)
Ki 0.2±n/a nM
Citation Murali Dhar, TGNagarathnam, DMarzabadi, MRLagu, BWong, WCChiu, GTyagarajan, SMiao, SWZhang, FSun, WTian, DShen, QZhang, JWetzel, JMForray, CChang, RSBroten, TPSchorn, TWChen, TBO'Malley, SRansom, RSchneck, KBendesky, RHarrell, CMVyas, KP Design and synthesis of novel alpha(1)(a) adrenoceptor-selective antagonists. 2. Approaches to eliminate opioid agonist metabolites via modification of linker and 4-methoxycarbonyl-4-phenylpiperidine moiety. J Med Chem42:4778-93 (1999) Alpha-1A adrenergic receptor
Name:Alpha-1A adrenergic receptor
Type:Cell-surface receptors
Mol. Mass.:51511.67
Organism:Homo sapiens (Human)
Description:P35348
Residue:466
BDBM50082812
NameBDBM50082812
Synonyms:3-{3-[4-Cyano-4-(3-fluoro-phenyl)-piperidin-1-yl]-propylcarbamoyl}-4-(3,4-difluoro-phenyl)-6-methoxymethyl-2-oxo-1,2,3,4-tetrahydro-pyrimidine-5-carboxylic acid methyl ester | CHEMBL262217
TypeSmall organic molecule
Emp. Form.C30H32F3N5O5
Mol. Mass.599.6008
SMILESCOCC1=C(C(N(C(=O)NCCCN2CCC(CC2)(C#N)c2cccc(F)c2)C(=O)N1)c1ccc(F)c(F)c1)C(=O)OC