Reaction Details
TargetAlpha-1B adrenergic receptor
LigandBDBM50082794
Substrate/Competitorn/a
Meas. Tech.ChEMBL_34458 (CHEMBL651990)
Ki 220±n/a nM
Citation Murali Dhar, TGNagarathnam, DMarzabadi, MRLagu, BWong, WCChiu, GTyagarajan, SMiao, SWZhang, FSun, WTian, DShen, QZhang, JWetzel, JMForray, CChang, RSBroten, TPSchorn, TWChen, TBO'Malley, SRansom, RSchneck, KBendesky, RHarrell, CMVyas, KP Design and synthesis of novel alpha(1)(a) adrenoceptor-selective antagonists. 2. Approaches to eliminate opioid agonist metabolites via modification of linker and 4-methoxycarbonyl-4-phenylpiperidine moiety. J Med Chem42:4778-93 (1999) Alpha-1B adrenergic receptor
Name:Alpha-1B adrenergic receptor
Type:Enzyme
Mol. Mass.:56862.13
Organism:Homo sapiens (Human)
Description:P35368
Residue:520
BDBM50082794
NameBDBM50082794
Synonyms:1-(3-{[5-Carbamoyl-6-(2,4-difluoro-phenyl)-4-ethyl-2-oxo-3,6-dihydro-2H-pyrimidine-1-carbonyl]-amino}-propyl)-4-phenyl-piperidine-4-carboxylic acid methyl ester | CHEMBL144925
TypeSmall organic molecule
Emp. Form.C30H35F2N5O5
Mol. Mass.583.6262
SMILESCCC1=C(C(N(C(=O)NCCCN2CCC(CC2)(C(=O)OC)c2ccccc2)C(=O)N1)c1ccc(F)cc1F)C(N)=O