Reaction Details
TargetAlpha-1A adrenergic receptor
LigandBDBM50082833
Substrate/Competitorn/a
Meas. Tech.ChEMBL_33740 (CHEMBL647055)
Ki 0.5±n/a nM
Citation Murali Dhar, TGNagarathnam, DMarzabadi, MRLagu, BWong, WCChiu, GTyagarajan, SMiao, SWZhang, FSun, WTian, DShen, QZhang, JWetzel, JMForray, CChang, RSBroten, TPSchorn, TWChen, TBO'Malley, SRansom, RSchneck, KBendesky, RHarrell, CMVyas, KP Design and synthesis of novel alpha(1)(a) adrenoceptor-selective antagonists. 2. Approaches to eliminate opioid agonist metabolites via modification of linker and 4-methoxycarbonyl-4-phenylpiperidine moiety. J Med Chem42:4778-93 (1999) Alpha-1A adrenergic receptor
Name:Alpha-1A adrenergic receptor
Type:Cell-surface receptors
Mol. Mass.:51511.67
Organism:Homo sapiens (Human)
Description:P35348
Residue:466
BDBM50082833
NameBDBM50082833
Synonyms:4-(3,4-Difluoro-phenyl)-6-methyl-3-[3-(4-methyl-4-phenyl-piperidin-1-yl)-propylcarbamoyl]-2-oxo-1,2,3,4-tetrahydro-pyrimidine-5-carboxylic acid methyl ester | CHEMBL146109
TypeSmall organic molecule
Emp. Form.C29H34F2N4O4
Mol. Mass.540.6015
SMILESCOC(=O)C1=C(C)NC(=O)N(C1c1ccc(F)c(F)c1)C(=O)NCCCN1CCC(C)(CC1)c1ccccc1