Reaction Details
TargetAlpha-1B adrenergic receptor
LigandBDBM50082843
Substrate/Competitorn/a
Meas. Tech.ChEMBL_34459 (CHEMBL651991)
Ki 16±n/a nM
Citation Lagu, BTian, DNagarathnam, DMarzabadi, MRWong, WCMiao, SWZhang, FSun, WChiu, GFang, JForray, CChang, RSRansom, RWChen, TBO'Malley, SZhang, KVyas, KPGluchowski, C Design and synthesis of novel alpha(1)(a) adrenoceptor-selective antagonists. 3. Approaches to eliminate opioid agonist metabolites by using substituted phenylpiperazine side chains. J Med Chem42:4794-803 (1999) Alpha-1B adrenergic receptor
Name:Alpha-1B adrenergic receptor
Type:Enzyme
Mol. Mass.:56862.13
Organism:Homo sapiens (Human)
Description:P35368
Residue:520
BDBM50082843
NameBDBM50082843
Synonyms:4-(3,4-Difluoro-phenyl)-3-{3-[4-(2-hydroxy-phenyl)-piperazin-1-yl]-propylcarbamoyl}-6-methyl-2-oxo-1,2,3,4-tetrahydro-pyrimidine-5-carboxylic acid methyl ester | CHEMBL141821
TypeSmall organic molecule
Emp. Form.C27H31F2N5O5
Mol. Mass.543.5623
SMILESCOC(=O)C1=C(C)NC(=O)N(C1c1ccc(F)c(F)c1)C(=O)NCCCN1CCN(CC1)c1ccccc1O