Reaction Details
TargetAlpha-1A adrenergic receptor
LigandBDBM50033111
Substrate/Competitorn/a
Meas. Tech.ChEMBL_33741 (CHEMBL647056)
Ki 6.9±n/a nM
Citation Lagu, BTian, DNagarathnam, DMarzabadi, MRWong, WCMiao, SWZhang, FSun, WChiu, GFang, JForray, CChang, RSRansom, RWChen, TBO'Malley, SZhang, KVyas, KPGluchowski, C Design and synthesis of novel alpha(1)(a) adrenoceptor-selective antagonists. 3. Approaches to eliminate opioid agonist metabolites by using substituted phenylpiperazine side chains. J Med Chem42:4794-803 (1999) Alpha-1A adrenergic receptor
Name:Alpha-1A adrenergic receptor
Type:Cell-surface receptors
Mol. Mass.:51511.67
Organism:Homo sapiens (Human)
Description:P35348
Residue:466
BDBM50033111
NameBDBM50033111
Synonyms:1-(4-Amino-6,7-dimethoxy-2-quinazolinyl)-4-((tetrahydro-2-furanyl)carbonyl)piperazine CHEMBL611 Terazosine
TypeSmall organic molecule
Emp. Form.C19H25N5O4
Mol. Mass.387.4329
SMILESCOc1cc2nc(nc(N)c2cc1OC)N1CCN(CC1)C(=O)C1CCCO1