Reaction Details
TargetAlpha-1A adrenergic receptor
LigandBDBM50082852
Substrate/Competitorn/a
Meas. Tech.ChEMBL_33741 (CHEMBL647056)
Ki 0.1±n/a nM
Citation Lagu, BTian, DNagarathnam, DMarzabadi, MRWong, WCMiao, SWZhang, FSun, WChiu, GFang, JForray, CChang, RSRansom, RWChen, TBO'Malley, SZhang, KVyas, KPGluchowski, C Design and synthesis of novel alpha(1)(a) adrenoceptor-selective antagonists. 3. Approaches to eliminate opioid agonist metabolites by using substituted phenylpiperazine side chains. J Med Chem42:4794-803 (1999) Alpha-1A adrenergic receptor
Name:Alpha-1A adrenergic receptor
Type:Cell-surface receptors
Mol. Mass.:51511.67
Organism:Homo sapiens (Human)
Description:P35348
Residue:466
BDBM50082852
NameBDBM50082852
Synonyms:4-(3,4-Difluoro-phenyl)-3-{3-[4-(2-methoxy-phenyl)-piperazin-1-yl]-propylcarbamoyl}-6-methyl-2-oxo-1,2,3,4-tetrahydro-pyrimidine-5-carboxylic acid methyl ester | CHEMBL146654
TypeSmall organic molecule
Emp. Form.C28H33F2N5O5
Mol. Mass.557.5889
SMILESCOC(=O)C1=C(C)NC(=O)N(C1c1ccc(F)c(F)c1)C(=O)NCCCN1CCN(CC1)c1ccccc1OC